Target
Metabotropic glutamate receptor 5
Ligand
BDBM292324
Substrate
Meas. Tech.
Calcium Influx Assay Based on Fluorescence
EC50
300±n/a nM
Citation
 Park, CEJang, YKShin, YJKim, JYHam, SMKim, YGMin, HKCha, SBJung, HJLee, JYHan, SNChung, JYChoi, EJJoung, CMPark, JSLee, JWCho, NRRyu, EJMaeng, CY Imidazopyrimidine and imidazotriazine derivative, and pharmaceutical composition comprising the same US Patent  US11046702 Publication Date 6/29/2021 
Target
Name:
Metabotropic glutamate receptor 5
Synonyms:
GPRC1E GRM5_HUMAN metabotropic glutamate 5 | metabotropic glutamate 5a
Type:
Enzyme
Mol. Mass.:
132484.72
Organism:
Homo sapiens (Human)
Description:
Residue:
1212
  
Inhibitor
Name:
BDBM292324
Synonyms:
US10100057, Example 179 US9745310, Example 179
Type:
Small organic molecule
Emp. Form.:
C17H11F2N5O
Mol. Mass.:
339.2989
SMILES:
Fc1ccc(c(F)c1)-c1cnc2nc(COc3ccncc3)cn2n1
: