Target
Alkaline phosphatase, tissue-nonspecific isozyme
Ligand
BDBM508470
Substrate
Meas. Tech.
Inhibitory Test of TNAP Activity
IC50
6.50±n/a nM
Citation
 Miyazaki, SInui, MKurosaki, YYamamoto, YIzumi, MSoma, KPinkerton, AKishida, M Sulfonamide compounds US Patent  US11046710 Publication Date 6/29/2021 
Target
Name:
Alkaline phosphatase, tissue-nonspecific isozyme
Synonyms:
ALPL tissue-nonspecific alkaline phosphatase precursor
Type:
PROTEIN
Mol. Mass.:
57306.17
Organism:
Homo sapiens (Human)
Description:
ChEMBL_1448917
Residue:
524
  
Inhibitor
Name:
BDBM508470
Synonyms:
US11046710, Example 7
Type:
Small organic molecule
Emp. Form.:
C17H15ClN4O4S
Mol. Mass.:
406.843
SMILES:
COc1ccc(Cl)cc1S(=O)(=O)Nc1cnc2OCCn3nccc3-c2c1
: