Target
Protein O-GlcNAcase
Ligand
BDBM408142
Substrate
Meas. Tech.
Human O-GlcNAcase Enzyme Inhibition Assay
IC50
125±n/a nM
Citation
 Quattropani, AKulkarni, SSGiri, AG Glycosidase inhibitors US Patent  US11046712 Publication Date 6/29/2021 
Target
Name:
Protein O-GlcNAcase
Synonyms:
2-acetamido-2-deoxy-β-D-glucopyranosidase (O-GlcNAcase) Beta-hexosaminidase (O-GlcNAcase) HEXC MEA5 N-acetyl-beta-D-glucosaminidase (O-GlcNAcase) OGA Protein O-GlcNAcase
Type:
Enzyme
Mol. Mass.:
102874.67
Organism:
Homo sapiens (Human)
Description:
O60502
Residue:
916
  
Inhibitor
Name:
BDBM408142
Synonyms:
4-(4-(1-(Benzo[d][1,3]dioxol-5-yl)ethyl)piperazin-1-yl)pyrimidin-2-amine US11046712, No 46
Type:
Small organic molecule
Emp. Form.:
C17H21N5O2
Mol. Mass.:
327.3809
SMILES:
CC(N1CCN(CC1)c1ccnc(N)n1)c1ccc2OCOc2c1
: