Target
Protein O-GlcNAcase
Ligand
BDBM508588
Substrate
Meas. Tech.
Human O-GlcNAcase Enzyme Inhibition Assay
IC50
5500±n/a nM
Citation
 Quattropani, AKulkarni, SSGiri, AG Glycosidase inhibitors US Patent  US11046712 Publication Date 6/29/2021 
Target
Name:
Protein O-GlcNAcase
Synonyms:
2-acetamido-2-deoxy-β-D-glucopyranosidase (O-GlcNAcase) Beta-hexosaminidase (O-GlcNAcase) HEXC MEA5 N-acetyl-beta-D-glucosaminidase (O-GlcNAcase) OGA Protein O-GlcNAcase
Type:
Enzyme
Mol. Mass.:
102874.67
Organism:
Homo sapiens (Human)
Description:
O60502
Residue:
916
  
Inhibitor
Name:
BDBM508588
Synonyms:
(R)—N-(5-(4-(1-(benzordin,31dioxol-5-yl)ethyl)piperazin-1-yl)-1,3,4-thiadiazol-2-yl)acetamide and (S)—N-(5-(4-(1-(benzofdlH,31dioxol-5-yl)ethyl)piperazin-1-yl)-1,3,4-thiadiazol-2-yl)acetamide US11046712, No 69
Type:
Small organic molecule
Emp. Form.:
C17H21N5O3S
Mol. Mass.:
375.445
SMILES:
C[C@H](N1CCN(CC1)c1nnc(NC(C)=O)s1)c1ccc2OCOc2c1
: