Target
Adenosine receptor A2a
Ligand
BDBM508599
Substrate
Meas. Tech.
competition binding assay
Ki
1.10±n/a nM
Citation
 Amjad, AGallo, GVHenderson, TJKuang, RLim, YLo, MMMetzger, Ede Lera Ruiz, MStamford, ATempest, PWhitehead, BWu, H 2,2-difluorodioxolo A2A receptor antagonists US Patent  US11046714 Publication Date 6/29/2021 
Target
Name:
Adenosine receptor A2a
Synonyms:
A2A adenosine receptor (hA2A) ADENOSINE A2 ADORA2 Adenosine A2A receptor (A2AAR)
Type:
G Protein-Coupled Receptor (GPCR)
Mol. Mass.:
44716.46
Organism:
Homo sapiens (Human)
Description:
P29274
Residue:
412
  
Inhibitor
Name:
BDBM508599
Synonyms:
4-[2-(5-amino-2,2-difluoro[1,3] dioxolo[4,5-h][1,2,4]triazolo [1,5-c]quinazolin-8-yl)ethyl]-1- (3-fluorophenyl)piperazin-2-one | US11046714, Example 50
Type:
Small organic molecule
Emp. Form.:
C22H18F3N7O3
Mol. Mass.:
485.4186
SMILES:
Nc1nc2c3OC(F)(F)Oc3ccc2c2nc(CCN3CCN(C(=O)C3)c3cccc(F)c3)nn12
: