Target
Adenosine receptor A2a
Ligand
BDBM508671
Substrate
Meas. Tech.
competition binding assay
Ki
7.50±n/a nM
Citation
 Amjad, AGallo, GVHenderson, TJKuang, RLim, YLo, MMMetzger, Ede Lera Ruiz, MStamford, ATempest, PWhitehead, BWu, H 2,2-difluorodioxolo A2A receptor antagonists US Patent  US11046714 Publication Date 6/29/2021 
Target
Name:
Adenosine receptor A2a
Synonyms:
A2A adenosine receptor (hA2A) ADENOSINE A2 ADORA2 Adenosine A2A receptor (A2AAR)
Type:
G Protein-Coupled Receptor (GPCR)
Mol. Mass.:
44716.46
Organism:
Homo sapiens (Human)
Description:
P29274
Residue:
412
  
Inhibitor
Name:
BDBM508671
Synonyms:
8-{[(2R)-4-(4-chloro-1,2,5- thiadiazol-3-yl)-2-methylpiperazin- 1-yl]methyl}-2,2-difluoro[1,3] dioxolo[4,5-h][1,2,4]triazolo[1,5- c]quinazolin-5-amine | US11046714, Example 108
Type:
Small organic molecule
Emp. Form.:
C18H16ClF2N9O2S
Mol. Mass.:
495.894
SMILES:
C[C@@H]1CN(CCN1Cc1nc2c3ccc4OC(F)(F)Oc4c3nc(N)n2n1)c1nsnc1Cl
: