Target
Adenosine receptor A2a
Ligand
BDBM508706
Substrate
Meas. Tech.
competition binding assay
Ki
55.0±n/a nM
Citation
 Amjad, AGallo, GVHenderson, TJKuang, RLim, YLo, MMMetzger, Ede Lera Ruiz, MStamford, ATempest, PWhitehead, BWu, H 2,2-difluorodioxolo A2A receptor antagonists US Patent  US11046714 Publication Date 6/29/2021 
Target
Name:
Adenosine receptor A2a
Synonyms:
A2A adenosine receptor (hA2A) ADENOSINE A2 ADORA2 Adenosine A2A receptor (A2AAR)
Type:
G Protein-Coupled Receptor (GPCR)
Mol. Mass.:
44716.46
Organism:
Homo sapiens (Human)
Description:
P29274
Residue:
412
  
Inhibitor
Name:
BDBM508706
Synonyms:
US11046714, Example 140 | US11046714, Example 141
Type:
Small organic molecule
Emp. Form.:
C18H17F5N6O2
Mol. Mass.:
444.3586
SMILES:
Nc1nc2c3OC(F)(F)Oc3ccc2c2nc(nn12)C1CCCN(CCC(F)(F)F)C1
: