Target
Adenosine receptor A2a
Ligand
BDBM508713
Substrate
Meas. Tech.
competition binding assay
Ki
2.90±n/a nM
Citation
 Amjad, AGallo, GVHenderson, TJKuang, RLim, YLo, MMMetzger, Ede Lera Ruiz, MStamford, ATempest, PWhitehead, BWu, H 2,2-difluorodioxolo A2A receptor antagonists US Patent  US11046714 Publication Date 6/29/2021 
Target
Name:
Adenosine receptor A2a
Synonyms:
A2A adenosine receptor (hA2A) ADENOSINE A2 ADORA2 Adenosine A2A receptor (A2AAR)
Type:
G Protein-Coupled Receptor (GPCR)
Mol. Mass.:
44716.46
Organism:
Homo sapiens (Human)
Description:
P29274
Residue:
412
  
Inhibitor
Name:
BDBM508713
Synonyms:
US11046714, Example 147
Type:
Small organic molecule
Emp. Form.:
C19H16F2N8O2
Mol. Mass.:
426.3795
SMILES:
Nc1nc2c3OC(F)(F)Oc3ccc2c2nc(nn12)[C@@H]1CCCN(C1)c1cncnc1
: