Target
Adenosine receptor A2a
Ligand
BDBM508723
Substrate
Meas. Tech.
competition binding assay
Ki
75.0±n/a nM
Citation
 Amjad, AGallo, GVHenderson, TJKuang, RLim, YLo, MMMetzger, Ede Lera Ruiz, MStamford, ATempest, PWhitehead, BWu, H 2,2-difluorodioxolo A2A receptor antagonists US Patent  US11046714 Publication Date 6/29/2021 
Target
Name:
Adenosine receptor A2a
Synonyms:
A2A adenosine receptor (hA2A) ADENOSINE A2 ADORA2 Adenosine A2A receptor (A2AAR)
Type:
G Protein-Coupled Receptor (GPCR)
Mol. Mass.:
44716.46
Organism:
Homo sapiens (Human)
Description:
P29274
Residue:
412
  
Inhibitor
Name:
BDBM508723
Synonyms:
(R or S)-2,2-difluoro-8-{[1- (2-methoxyethyl)pyrrolidin- 3-yl]methyl}[1,3]dioxolo [4,5-h][1,2,4]triazolo[1,5- c]quinazolin-5-amine | US11046714, Example 157
Type:
Small organic molecule
Emp. Form.:
C18H20F2N6O3
Mol. Mass.:
406.3866
SMILES:
COCCN1CCC(Cc2nc3c4ccc5OC(F)(F)Oc5c4nc(N)n3n2)C1
: