Target
Galectin-1
Ligand
BDBM508752
Substrate
Meas. Tech.
fluorescence anisotropy assay
Kd
44.0±n/a nM
Citation
 Zetterberg, F Galactoside inhibitor of galectins US Patent  US11046725 Publication Date 6/29/2021 
Target
Name:
Galectin-1
Synonyms:
14 kDa lectin HPL LGALS1 Lectin galactoside-binding soluble 1 | Putative MAPK-activating protein PM12
Type:
beta galactoside-binding protein
Mol. Mass.:
14713.53
Organism:
Homo sapiens (Human)
Description:
P09382
Residue:
135
  
Inhibitor
Name:
BDBM508752
Synonyms:
4-Chloro-N,N′-dimethylbenzamide-2-yl 3-deoxy-3-[4-(2-hydroxythiazol-4-yl)-1H-1,2,3-triazol-1-yl]-1-thio-α-D-galactopyranoside | US11046725, Example 32
Type:
Small organic molecule
Emp. Form.:
C20H22ClN5O6S2
Mol. Mass.:
528.002
SMILES:
CN(C)C(=O)c1ccc(Cl)cc1S[C@H]1OC(CO)[C@H](O)[C@@H](C1O)n1cc(nn1)-c1csc(O)n1
: