Target
Replicase polyprotein 1ab
Ligand
BDBM510050
Substrate
Meas. Tech.
SARS-CoV-2 Coronavirus 3C Protease FRET Assay
IC50
1080±n/a nM
Citation
 Owen, DRPettersson, MYReese, MRSammons, MFTuttle, JBVerhoest, PRWEI, LYANG, QYang, X Nitrile-containing antiviral compounds WIPO 0:0 (2021) Target
Name:
Replicase polyprotein 1ab
Synonyms:
ORF1ab polyprotein pp1ab | rep
Type:
Protein
Mol. Mass.:
794070.71
Organism:
2019-nCoV
Description:
P0DTD1
Residue:
7096
  
Inhibitor
Name:
BDBM510050
Synonyms:
N-{(1S)-1-Cyano-2-[(3S)-2-oxopyrrolidin-3-yl]ethyl}-4-methyl-N2-(pyrrolidin-1-ylacetyl)-L- leucinamide, trifluoroacetate salt (2) WO2021250648, Example 2
Type:
Small organic molecule
Emp. Form.:
C20H33N5O3
Mol. Mass.:
391.5077
SMILES:
CC(C)(C)C[C@H](NC(=O)CN1CCCC1)C(=O)N[C@@H](C[C@@H]1CCNC1=O)C#N
: