Target
Replicase polyprotein 1ab
Ligand
BDBM510057
Substrate
Meas. Tech.
Antiviral activity from SARS-CoV-2 infection
EC50
970±n/a nM
Citation
 Owen, DRPettersson, MYReese, MRSammons, MFTuttle, JBVerhoest, PRWEI, LYANG, QYang, X Nitrile-containing antiviral compounds WIPO 0:0 (2021) Target
Name:
Replicase polyprotein 1ab
Synonyms:
ORF1ab polyprotein pp1ab | rep
Type:
Protein
Mol. Mass.:
794070.71
Organism:
2019-nCoV
Description:
P0DTD1
Residue:
7096
  
Inhibitor
Name:
BDBM510057
Synonyms:
N-{1-Cyano-2-[(3S)-2-oxopyrrolidin-3-yl]ethyl}-N2- [cyclohexyl(methoxy)acetyl]-4-methyl-L-leucinamide, DIAST-2 (9) | WO2021250648, Example 9
Type:
Small organic molecule
Emp. Form.:
C23H38N4O4
Mol. Mass.:
434.5722
SMILES:
COC(C1CCCCC1)C(=O)N[C@@H](CC(C)(C)C)C(=O)N[C@H](C[C@@H]1CCNC1=O)C#N
: