Target
Replicase polyprotein 1ab
Ligand
BDBM510077
Substrate
Meas. Tech.
SARS-CoV-2 Coronavirus 3C Protease FRET Assay
IC50
2230±n/a nM
Citation
 Owen, DRPettersson, MYReese, MRSammons, MFTuttle, JBVerhoest, PRWEI, LYANG, QYang, X Nitrile-containing antiviral compounds WIPO 0:0 (2021) Target
Name:
Replicase polyprotein 1ab
Synonyms:
ORF1ab polyprotein pp1ab | rep
Type:
Protein
Mol. Mass.:
794070.71
Organism:
2019-nCoV
Description:
P0DTD1
Residue:
7096
  
Inhibitor
Name:
BDBM510077
Synonyms:
US11351149, Example 29 | WO2021250648, Example 29
Type:
Small organic molecule
Emp. Form.:
C19H29F3N4O3
Mol. Mass.:
418.4538
SMILES:
CC(CC(=O)N[C@@H](CC(C)(C)C)C(=O)N[C@@H](C[C@@H]1CCNC1=O)C#N)C(F)(F)F
: