Target
Replicase polyprotein 1ab
Ligand
BDBM510111
Substrate
Meas. Tech.
SARS-CoV-2 Coronavirus 3C Protease FRET Assay
IC50
117±n/a nM
Citation
 Owen, DRPettersson, MYReese, MRSammons, MFTuttle, JBVerhoest, PRWEI, LYANG, QYang, X Nitrile-containing antiviral compounds WIPO 0:0 (2021) Target
Name:
Replicase polyprotein 1ab
Synonyms:
ORF1ab polyprotein pp1ab | rep
Type:
Protein
Mol. Mass.:
794070.71
Organism:
2019-nCoV
Description:
P0DTD1
Residue:
7096
  
Inhibitor
Name:
BDBM510111
Synonyms:
US11351149, Example 65 WO2021250648, Example 65
Type:
Small organic molecule
Emp. Form.:
C22H26ClN5O3
Mol. Mass.:
443.927
SMILES:
CC(C)C[C@H](NC(=O)c1cc2cc(Cl)ccc2[nH]1)C(=O)N[C@@H](C[C@@H]1CCNC1=O)C#N
: