Target
Replicase polyprotein 1ab
Ligand
BDBM510121
Substrate
Meas. Tech.
Antiviral activity from SARS-CoV-2 infection
EC50
2030±n/a nM
Citation
 Owen, DRPettersson, MYReese, MRSammons, MFTuttle, JBVerhoest, PRWEI, LYANG, QYang, X Nitrile-containing antiviral compounds WIPO 0:0 (2021) Target
Name:
Replicase polyprotein 1ab
Synonyms:
ORF1ab polyprotein pp1ab | rep
Type:
Protein
Mol. Mass.:
794070.71
Organism:
2019-nCoV
Description:
P0DTD1
Residue:
7096
  
Inhibitor
Name:
BDBM510121
Synonyms:
US11351149, Example 73 | WO2021250648, Example 73
Type:
Small organic molecule
Emp. Form.:
C19H27ClN6O3
Mol. Mass.:
422.909
SMILES:
CC(C)C[C@H](NC(=O)c1c(Cl)c(C)nn1C)C(=O)N[C@@H](C[C@@H]1CCNC1=O)C#N
: