Target
Replicase polyprotein 1ab
Ligand
BDBM510127
Substrate
Meas. Tech.
Antiviral activity from SARS-CoV-2 infection
EC50
80±n/a nM
Citation
 Owen, DRPettersson, MYReese, MRSammons, MFTuttle, JBVerhoest, PRWEI, LYANG, QYang, X Nitrile-containing antiviral compounds WIPO 0:0 (2021) Target
Name:
Replicase polyprotein 1ab
Synonyms:
ORF1ab polyprotein pp1ab | rep
Type:
Protein
Mol. Mass.:
794070.71
Organism:
2019-nCoV
Description:
P0DTD1
Residue:
7096
  
Inhibitor
Name:
BDBM510127
Synonyms:
Methyl {(2S)-1-[(1R,2S,5S)-2-({(1S)-1-cyano-2-[(3S)-2-oxopyrrolidin-3- yl]ethyl}carbamoyl)-6,6-dimethyl-3-azabicyclo[3.1.0]hexan-3-yl]-3,3-dimethyl-1- oxobutan-2-yl}carbamate (79) WO2021250648, Example 79 | WO2021250648, Example 95
Type:
Small organic molecule
Emp. Form.:
C23H35N5O5
Mol. Mass.:
461.5545
SMILES:
COC(=O)N[C@H](C(=O)N1C[C@H]2[C@@H]([C@H]1C(=O)N[C@@H](C[C@@H]1CCNC1=O)C#N)C2(C)C)C(C)(C)C
: