Target
Replicase polyprotein 1ab
Ligand
BDBM512437
Substrate
Meas. Tech.
In vitro assay (SARS-CoV-2 M proenzymatic assay)
IC50
2510±n/a nM
Citation
 Zavoronkovs, AIVANENKOV, YAZAGRIBELNYY, B Sars-cov-2 inhibitors having covalent modifications for treating coronavirus infections WIPO 0:0 (2021) Target
Name:
Replicase polyprotein 1ab
Synonyms:
ORF1ab polyprotein pp1ab | rep
Type:
Protein
Mol. Mass.:
794070.71
Organism:
2019-nCoV
Description:
P0DTD1
Residue:
7096
  
Inhibitor
Name:
BDBM512437
Synonyms:
WO2021219089, INSCoV-501D
Type:
Small organic molecule
Emp. Form.:
C25H22ClN5O5S
Mol. Mass.:
539.991
SMILES:
Cc1ccc(cc1)S(=O)(=O)CNC(=O)C(N(C(=O)CCl)c1ccc(cc1)-c1cnco1)c1cncnc1
: