Target
Replicase polyprotein 1ab
Ligand
BDBM70763
Substrate
Meas. Tech.
In vitro assay (SARS-CoV-2 M proenzymatic assay)
IC50
>25000±n/a nM
Citation
 Zavoronkovs, AIVANENKOV, YAZAGRIBELNYY, B Sars-cov-2 inhibitors having covalent modifications for treating coronavirus infections WIPO 0:0 (2021) Target
Name:
Replicase polyprotein 1ab
Synonyms:
ORF1ab polyprotein pp1ab | rep
Type:
Protein
Mol. Mass.:
794070.71
Organism:
2019-nCoV
Description:
P0DTD1
Residue:
7096
  
Inhibitor
Name:
BDBM70763
Synonyms:
2-(N-(2-chloro-1-oxoethyl)-3,4-dimethylanilino)-N-cyclohexyl-2-(3-pyridinyl)acetamide 2-(N-(2-chloroacetyl)-3,4-dimethylanilino)-N-cyclohexyl-2-pyridin-3-ylacetamide 2-[2-chloranylethanoyl-(3,4-dimethylphenyl)amino]-N-cyclohexyl-2-pyridin-3-yl-ethanamide SMR000206937 cid_4381125
Type:
Small organic molecule
Emp. Form.:
C23H28ClN3O2
Mol. Mass.:
413.94
SMILES:
Cc1ccc(cc1C)N(C(C(=O)NC1CCCCC1)c1cccnc1)C(=O)CCl
: