Target
Replicase polyprotein 1ab
Ligand
BDBM512585
Substrate
Meas. Tech.
In vitro assay (SARS-CoV-2 M proenzymatic assay)
IC50
11360±n/a nM
Citation
 Zavoronkovs, AIVANENKOV, YAZAGRIBELNYY, B Sars-cov-2 inhibitors having covalent modifications for treating coronavirus infections WIPO 0:0 (2021) Target
Name:
Replicase polyprotein 1ab
Synonyms:
ORF1ab polyprotein pp1ab | rep
Type:
Protein
Mol. Mass.:
794070.71
Organism:
2019-nCoV
Description:
P0DTD1
Residue:
7096
  
Inhibitor
Name:
BDBM512585
Synonyms:
WO2021219089, INSCoV-517C (2)
Type:
Small organic molecule
Emp. Form.:
C22H18ClF6N5O3
Mol. Mass.:
549.853
SMILES:
F[C@@H](Cl)C(=O)N([C@H](C(=O)NC1CCC(F)(F)CC1)c1cncnc1)c1ccc(OC(F)(F)F)cc1C#N
: