Target
Replicase polyprotein 1ab
Ligand
BDBM512829
Substrate
Meas. Tech.
In vitro assay (SARS-CoV-2 M proenzymatic assay)
IC50
100±n/a nM
Citation
 Zavoronkovs, AIVANENKOV, YAZAGRIBELNYY, B Sars-cov-2 inhibitors having covalent modifications for treating coronavirus infections WIPO 0:0 (2021) Target
Name:
Replicase polyprotein 1ab
Synonyms:
ORF1ab polyprotein pp1ab | rep
Type:
Protein
Mol. Mass.:
794070.71
Organism:
2019-nCoV
Description:
P0DTD1
Residue:
7096
  
Inhibitor
Name:
BDBM512829
Synonyms:
WO2021219089, INSCoV-601H
Type:
Small organic molecule
Emp. Form.:
C23H22ClF2N5O3
Mol. Mass.:
489.902
SMILES:
FC1(F)CCC(CC1)NC(=O)C(N(C(=O)CCl)c1ccc(cc1)-c1ccno1)c1cnccn1
: