Target
Diacylglycerol O-acyltransferase 2
Ligand
BDBM517327
Substrate
Meas. Tech.
Enzymatic Activity Assay
IC50
2.10±n/a nM
Citation
 Shen, DGraham, THLiu, WTudge, CVerras, AJiang, J Indazole derivatives useful as inhibitors of diacylglyceride O-acyltransferase 2 US Patent  US11104690 Publication Date 8/31/2021 
Target
Name:
Diacylglycerol O-acyltransferase 2
Synonyms:
ARAT DGAT2 Diacylglycerol O-acyltransferase 2 (DGAT2) Retinol O-fatty-acyltransferase
Type:
Multi-pass membrane protein
Mol. Mass.:
43848.90
Organism:
Homo sapiens (Human)
Description:
Q96PD7
Residue:
388
  
Inhibitor
Name:
BDBM517327
Synonyms:
3-(3-cyclopropylphenyl)-1- (4-fluorophenyl)-N-(3- methyl-1,1- dioxidotetrahydrothiophen- 3-yl)-1H-indazole-6- carboxamide (enantiomer A) | US11104690, Example 145-A
Type:
Small organic molecule
Emp. Form.:
C28H26FN3O3S
Mol. Mass.:
503.588
SMILES:
C[C@]1(CCS(=O)(=O)C1)NC(=O)c1ccc2c(nn(-c3ccc(F)cc3)c2c1)-c1cccc(c1)C1CC1
: