Target
Mitogen-activated protein kinase kinase kinase kinase 1
Ligand
BDBM519746
Substrate
Meas. Tech.
HPK1 Biochemical Enzyme Assay
Ki
0.060±n/a nM
Citation
 Gallego, RANair, SKKania, RSAhmad, OKJohnson, TWTuttle, JBJalaie, MMcTigue, MAZhou, DDel Bel, MLZhou, RHe, MSchmitt, AD Azalactam compounds as HPK1 inhibitors US Patent  US11142525 Publication Date 10/12/2021 
Target
Name:
Mitogen-activated protein kinase kinase kinase kinase 1
Synonyms:
HPK1 MAP4K1
Type:
PROTEIN
Mol. Mass.:
91316.07
Organism:
Homo sapiens (Human)
Description:
ChEMBL_586597
Residue:
833
  
Inhibitor
Name:
BDBM519746
Synonyms:
US11142525, Example 150
Type:
Small organic molecule
Emp. Form.:
C24H32N8O
Mol. Mass.:
448.5639
SMILES:
CCC(CC)n1cnnc1-c1cccc(n1)N1Cc2c(cc(nc2CN)N(C)C(C)C)C1=O
: