Target
Replicase polyprotein 1ab
Ligand
BDBM525155
Substrate
Meas. Tech.
SARS-CoV-2 3CLPpro inhibition assay
IC50
890±n/a nM
Citation
 Chen, JLiang, CMIAO, KWu, YYun, HZhang, W Aminocarbamoyl compounds for the treatment of viral infections WIPO 0:0 (2022) Target
Name:
Replicase polyprotein 1ab
Synonyms:
ORF1ab polyprotein pp1ab | rep
Type:
Protein
Mol. Mass.:
794070.71
Organism:
2019-nCoV
Description:
P0DTD1
Residue:
7096
  
Inhibitor
Name:
BDBM525155
Synonyms:
Benzyl N-[(1S)-1-[[(3-amino-3-oxo-propyl)-(2-chloro-2-phenyl-acetyl)amino]carbamoyl]-3-methyl-butyl]carbamate | WO2022043374, Example 3
Type:
Small organic molecule
Emp. Form.:
C25H31ClN4O5
Mol. Mass.:
502.99
SMILES:
CC(C)C[C@H](NC(=O)OCc1ccccc1)C(=O)NN(CCC(N)=O)C(=O)C(Cl)c1ccccc1
: