Target
Replicase polyprotein 1ab
Ligand
BDBM525176
Substrate
Meas. Tech.
SARS-CoV-2 3CLPpro inhibition assay
IC50
7.00±n/a nM
Citation
 Chen, JLiang, CMIAO, KWu, YYun, HZhang, W Aminocarbamoyl compounds for the treatment of viral infections WIPO 0:0 (2022) Target
Name:
Replicase polyprotein 1ab
Synonyms:
ORF1ab polyprotein pp1ab | rep
Type:
Protein
Mol. Mass.:
794070.71
Organism:
2019-nCoV
Description:
P0DTD1
Residue:
7096
  
Inhibitor
Name:
BDBM525176
Synonyms:
N-[(1S)-1-[[(3-amino-3-oxo-propyl)-(2-chloroacetyl)amino]carbamoyl]-3-methyl-butyl]-1H-indole-2-carboxamide | WO2022043374, Example 28
Type:
Small organic molecule
Emp. Form.:
C20H26ClN5O5
Mol. Mass.:
451.904
SMILES:
CC(C)C[C@H](NC(=O)Oc1cc2ccccc2[nH]1)C(=O)NN(CCC(N)=O)C(=O)CCl
: