Target
Replicase polyprotein 1ab
Ligand
BDBM525234
Substrate
Meas. Tech.
SARS-CoV-2 3CLPpro inhibition assay
IC50
150±n/a nM
Citation
 Chen, JLiang, CMIAO, KWu, YYun, HZhang, W Aminocarbamoyl compounds for the treatment of viral infections WIPO 0:0 (2022) Target
Name:
Replicase polyprotein 1ab
Synonyms:
ORF1ab polyprotein pp1ab | rep
Type:
Protein
Mol. Mass.:
794070.71
Organism:
2019-nCoV
Description:
P0DTD1
Residue:
7096
  
Inhibitor
Name:
BDBM525234
Synonyms:
N-[rac-(1S)-2-[2-(3-amino-3-oxo-propyl)-2-(2-chloro-2-fluoro-acetyl)hydrazino]-1-(cyclobutylmethyl)-2-oxo-ethyl]pyrazine-2-carboxamide | WO2022043374, Example 79
Type:
Small organic molecule
Emp. Form.:
C17H22ClFN6O4
Mol. Mass.:
428.846
SMILES:
NC(=O)CCN(NC(=O)[C@H](CC1CCC1)NC(=O)c1cnccn1)C(=O)C(F)Cl
: