Target
Replicase polyprotein 1ab
Ligand
BDBM525237
Substrate
Meas. Tech.
SARS-CoV-2 3CLPpro inhibition assay
IC50
60±n/a nM
Citation
 Chen, JLiang, CMIAO, KWu, YYun, HZhang, W Aminocarbamoyl compounds for the treatment of viral infections WIPO 0:0 (2022) Target
Name:
Replicase polyprotein 1ab
Synonyms:
ORF1ab polyprotein pp1ab | rep
Type:
Protein
Mol. Mass.:
794070.71
Organism:
2019-nCoV
Description:
P0DTD1
Residue:
7096
  
Inhibitor
Name:
BDBM525237
Synonyms:
3-[[(2R)-2-chloro-2-fluoro-acetyl]-[[(2S)-2-[[2-(3-methoxyanilino)acetyl]amino]-4-methyl-pentanoyl]amino]amino]propanamide | WO2022043374, Example 83-B
Type:
Small organic molecule
Emp. Form.:
C20H29ClFN5O5
Mol. Mass.:
473.926
SMILES:
COc1cccc(NCC(=O)N[C@@H](CC(C)C)C(=O)NN(CCC(N)=O)C(=O)[C@@H](F)Cl)c1
: