Target
Replicase polyprotein 1ab
Ligand
BDBM525246
Substrate
Meas. Tech.
SARS-CoV-2 3CLPpro inhibition assay
IC50
650±n/a nM
Citation
 Chen, JLiang, CMIAO, KWu, YYun, HZhang, W Aminocarbamoyl compounds for the treatment of viral infections WIPO 0:0 (2022) Target
Name:
Replicase polyprotein 1ab
Synonyms:
ORF1ab polyprotein pp1ab | rep
Type:
Protein
Mol. Mass.:
794070.71
Organism:
2019-nCoV
Description:
P0DTD1
Residue:
7096
  
Inhibitor
Name:
BDBM525246
Synonyms:
N-[rac-(1S)-1-[[(3-amino-3-oxo-propyl)-[rac-(2R)-2-chloro-2-fluoro-acetyl]amino]carbamoyl]-3-methyl-butyl]imidazo[1,2-a]pyridine-2-carboxamide | WO2022043374, Example 95
Type:
Small organic molecule
Emp. Form.:
C19H24ClFN6O4
Mol. Mass.:
454.883
SMILES:
CC(C)C[C@H](NC(=O)c1cn2ccccc2n1)C(=O)NN(CCC(N)=O)C(=O)C(F)Cl
: