Target
Replicase polyprotein 1ab
Ligand
BDBM525250
Substrate
Meas. Tech.
SARS-CoV 3CLp ro inhibition assay
IC50
93±n/a nM
Citation
 Chen, JLiang, CMIAO, KWu, YYun, HZhang, W Aminocarbamoyl compounds for the treatment of viral infections WIPO 0:0 (2022) Target
Name:
Replicase polyprotein 1ab
Synonyms:
3C-like proteinase 3C-like proteinase (SARS-CoV 3Cpro) 3CLp GFL Guanine-N7 methyltransferase Helicase Leader protein Non-structural protein 10 Non-structural protein 3 Non-structural protein 6 Non-structural protein 8 ORF1ab polyprotein PL2-PRO Pol R1AB_SARS RdRp SARS coronavirus main proteinase nsp1 nsp12 nsp14 nsp16 nsp3 nsp5 nsp7 nsp9 pp1ab | rep
Type:
Protein
Mol. Mass.:
790250.81
Organism:
Human SARS coronavirus (SARS-CoV) (Severe acute respiratory syndrome coronavirus)
Description:
P0C6X7
Residue:
7073
  
Inhibitor
Name:
BDBM525250
Synonyms:
N-[(1S)-1-(1-bicyclo[1.1.1]pentanylmethyl)-2-[2-[(2R)-2-chloro-2-fluoro-acetyl]-2-[[(3S)-2-oxopyrrolidin-3-yl]methyl]hydrazino]-2-oxo-ethyl]-5-(trifluoromethyl)isoxazole-3-carboxamide | WO2022043374, Example 99
Type:
Small organic molecule
Emp. Form.:
C20H22ClF4N5O5
Mol. Mass.:
523.866
SMILES:
F[C@H](Cl)C(=O)N(C[C@@H]1CCNC1=O)NC(=O)[C@H](CC12CC(C1)C2)NC(=O)c1cc(on1)C(F)(F)F
: