Target
Angiotensin-converting enzyme/Ribosomal RNA small subunit methyltransferase NEP1
Ligand
BDBM471712
Substrate
Meas. Tech.
Enzyme Inhibition Assay
Ki
<1.000±n/a nM
Citation
 Fleury, MHughes, AD Neprilysin inhibitors US Patent  US11174219 Publication Date 11/16/2021 
Target
Name:
Angiotensin-converting enzyme/Ribosomal RNA small subunit methyltransferase NEP1
Synonyms:
Recombinant human NEP and recombinant human ACE
Type:
Protein
Mol. Mass.:
Description:
Components:
This complex has 2 components.
Component 1
Name:
Ribosomal RNA small subunit methyltransferase NEP1
Synonyms:
18S rRNA (pseudouridine(1248)-N1)-methyltransferase C2F NEP1_HUMAN Protein C2f | Ribosome biogenesis protein NEP1
Type:
Protein
Mol. Mass.:
26729.88
Organism:
Human
Description:
Q92979
Residue:
244
  
Component 2
Name:
Angiotensin-converting enzyme
Synonyms:
ACE Angiotensin converting enzyme (ACE) Angiotensin-converting enzyme, soluble form CD_antigen=CD143 DCP1 Kininase II
Type:
Enzyme
Mol. Mass.:
149709.01
Organism:
Homo sapiens (Human)
Description:
Residue:
1306
  
Inhibitor
Name:
BDBM471712
Synonyms:
US10829438, Example 4B | US11174219, Example 4B
Type:
Small organic molecule
Emp. Form.:
C25H25ClFN3O5
Mol. Mass.:
501.935
SMILES:
CCOC(=O)[C@H](O)C[C@@H](Cc1ccc(cc1)-c1cc(Cl)ccc1F)NC(=O)c1cc([nH]n1)C(C)=O
: