Target
DNA-binding protein Ikaros
Ligand
BDBM526270
Substrate
Meas. Tech.
Prolabel Quantification of IKZF1, IKZF2, or GSPT1 Protein Levels in 293GT Cells
EC50
630±n/a nM
Citation
 Beckwith, REBonazzi, SCernijenko, AMa, FWare, NF 3-(5-amino-1-oxoisoindolin-2-yl)piperidine-2,6-dione derivatives and uses thereof US Patent  US11185537 Publication Date 11/30/2021 
Target
Name:
DNA-binding protein Ikaros
Synonyms:
DNA-binding protein Ikaros IKAROS IKZF1_HUMAN LYF1 ZNFN1A1
Type:
PROTEIN
Mol. Mass.:
57528.78
Organism:
Homo sapiens
Description:
ChEMBL_120150
Residue:
519
  
Inhibitor
Name:
BDBM526270
Synonyms:
US11185537, Compound Mix
Type:
Small organic molecule
Emp. Form.:
C22H28N4O5
Mol. Mass.:
428.4815
SMILES:
OC=O.CN[C@H]1CC=CC[C@@H]1N(C)c1ccc2C(=O)N(Cc2c1)C1CCC(=O)NC1=O
: