Target
CDK-activating kinase assembly factor MAT1/Cyclin-H/Cyclin-dependent kinase 7
Ligand
BDBM530312
Substrate
Meas. Tech.
n Vitro CDK7 (5 nM) Assay
IC50
5.75±n/a nM
Citation
 Anne, MLSophie, CÉPascal, ACEddy, LYChristophe, M CYCLIN-DEPENDENT KINASE 7 (CDK7) NON-COVALENT INHIBITORS WIPO 0:0 (2022) Target
Name:
CDK-activating kinase assembly factor MAT1/Cyclin-H/Cyclin-dependent kinase 7
Synonyms:
CDK-activating kinase assembly factor MAT1/Cyclin H/Cyclin-dependent kinase 7 | CDK7/Cyclin H/MNAT1
Type:
Protein
Mol. Mass.:
Description:
Components:
This complex has 3 components.
Component 1
Name:
Cyclin-dependent kinase 7
Synonyms:
39 kDa protein kinase CAK1 CDK-activating kinase 1 (CAK) CDK7_HUMAN Cell division protein kinase 7 Cyclin-dependent kinase 7 (CDK7/cyclin H) P39 Mo15 TFIIH basal transcription factor complex kinase subunit
Type:
Enzyme Subunit
Mol. Mass.:
39047.01
Organism:
Homo sapiens (Human)
Description:
Residue:
346
  
Component 2
Name:
Cyclin-H
Synonyms:
CCNH Cyclin H p34 | p37
Type:
Enzyme Subunit
Mol. Mass.:
37646.05
Organism:
Homo sapiens (Human)
Description:
Residue:
323
  
Component 3
Name:
CDK-activating kinase assembly factor MAT1
Synonyms:
CAP35 Cyclin-G1-interacting protein MAT1_HUMAN Menage a trois RING finger protein MAT1 p35 | p36
Type:
Enzyme
Mol. Mass.:
35820.03
Organism:
Homo sapiens (Human)
Description:
P51948
Residue:
309
  
Inhibitor
Name:
BDBM530312
Synonyms:
WO2022064009, Compound 73
Type:
Small organic molecule
Emp. Form.:
C29H37N7O
Mol. Mass.:
499.6504
SMILES:
CC(C1CC1)n1cc(Nc2ncc3C[C@@H](C)N(Cc3n2)C(=O)[C@H]2CCN(C)C[C@@H]2c2ccccc2)cn1
: