Target
Dihydroorotate dehydrogenase (quinone), mitochondrial
Ligand
BDBM530465
Substrate
Meas. Tech.
DHODH enzymatic assay
IC50
1.33±n/a nM
Citation
 Lindsey, DScott, K DIHYDROOROTATE DEHYDROGENASE INHIBITORS WIPO 0:0 (2022) Target
Name:
Dihydroorotate dehydrogenase (quinone), mitochondrial
Synonyms:
DHODH Dihydroorotate dehydrogenase Dihydroorotate dehydrogenase, mitochondrial Dihydroorotate oxidase (DHODH) | PYRD_HUMAN
Type:
Enzyme
Mol. Mass.:
42881.33
Organism:
Homo sapiens (Human)
Description:
Q02127
Residue:
395
  
Inhibitor
Name:
BDBM530465
Synonyms:
8-(4-Ethyl-3-(hydroxymethyl)-5-oxo-4,5-dihydro-1H-1,2,4-triazol-1-yl)-7-fluoro-1- isopropyl-3-(o-tolyl)-4H-quinolizin-4-one. | WO2022070071, Example 3
Type:
Small organic molecule
Emp. Form.:
C24H25FN4O3
Mol. Mass.:
436.4787
SMILES:
CCn1c(CO)nn(-c2cc3c(cc(-c4ccccc4C)c(=O)n3cc2F)C(C)C)c1=O
: