Target
fMet-Leu-Phe receptor
Ligand
BDBM530536
Substrate
EC50
81±n/a nM
Citation
 L., PHA., JJV., DS AMINOIMIDAZOLE FPR2 AGONISTS WIPO 0:0 (2022) Target
Name:
fMet-Leu-Phe receptor
Synonyms:
FPR FPR1_HUMAN N-formyl peptide receptor 1 fMLP receptor formyl peptide receptor 1
Type:
Enzyme Catalytic Domain
Mol. Mass.:
38456.14
Organism:
Homo sapiens (Human)
Description:
gi_4503779
Residue:
350
  
Inhibitor
Name:
BDBM530536
Synonyms:
N-[l-(2,6-Difluoro-4-methoxyphenyl)-4-[l-(ethanesulfonyl)piperidin-4-yl]-1H-imidazol-2-y 1 ]-4-(difluoromethoxy )b enzami de | WO2022076764, Example 65
Type:
Small organic molecule
Emp. Form.:
C25H26F4N4O5S
Mol. Mass.:
570.556
SMILES:
CCS(=O)(=O)N1CCC(CC1)c1cn(c(NC(=O)c2ccc(OC(F)F)cc2)n1)-c1c(F)cc(OC)cc1F
: