Target
fMet-Leu-Phe receptor
Ligand
BDBM530554
Substrate
EC50
5.00±n/a nM
Citation
 L., PHA., JJV., DS AMINOIMIDAZOLE FPR2 AGONISTS WIPO 0:0 (2022) Target
Name:
fMet-Leu-Phe receptor
Synonyms:
FPR FPR1_HUMAN N-formyl peptide receptor 1 fMLP receptor formyl peptide receptor 1
Type:
Enzyme Catalytic Domain
Mol. Mass.:
38456.14
Organism:
Homo sapiens (Human)
Description:
gi_4503779
Residue:
350
  
Inhibitor
Name:
BDBM530554
Synonyms:
N-[l-(2,6-Ddifluoro-4-methoxyphenyl)-4-(3-methanesulfonamidocyclobutyl)-1H-imidazol-2-yl]-4-(difluorom ethoxy )benzamide | WO2022076764, Example 83
Type:
Small organic molecule
Emp. Form.:
C23H22F4N4O5S
Mol. Mass.:
542.503
SMILES:
COc1cc(F)c(c(F)c1)-n1cc(nc1NC(=O)c1ccc(OC(F)F)cc1)C1CC(C1)NS(C)(=O)=O
: