Target
Diacylglycerol O-acyltransferase 2
Ligand
BDBM530692
Substrate
Meas. Tech.
DGAT2 enzymatic activity assay
IC50
73±n/a nM
Citation
 Yeon-Hee, LR., AEJianming, BChen, CP., RJHelen, SE PREPARATION OF BENZIMIDAZOLONE DERIVATIVES AS NOVEL DIACYLGLYCERIDE O-ACYLTRANSFERASE 2 INHIBITORS WIPO 0:0 (2022) Target
Name:
Diacylglycerol O-acyltransferase 2
Synonyms:
ARAT DGAT2 Diacylglycerol O-acyltransferase 2 (DGAT2) Retinol O-fatty-acyltransferase
Type:
Multi-pass membrane protein
Mol. Mass.:
43848.90
Organism:
Homo sapiens (Human)
Description:
Q96PD7
Residue:
388
  
Inhibitor
Name:
BDBM530692
Synonyms:
WO2022076495, EXAMPLE 123
Type:
Small organic molecule
Emp. Form.:
C21H20F4N4O5S
Mol. Mass.:
516.466
SMILES:
CC(C)n1c2cc(C(=O)NC3(C)CS(=O)(=O)C3)c(F)cc2n(-c2cc(OC(F)F)ncc2F)c1=O
: