Target
Diacylglycerol O-acyltransferase 2
Ligand
BDBM530696
Substrate
Meas. Tech.
DGAT2 enzymatic activity assay
IC50
112±n/a nM
Citation
 Yeon-Hee, LR., AEJianming, BChen, CP., RJHelen, SE PREPARATION OF BENZIMIDAZOLONE DERIVATIVES AS NOVEL DIACYLGLYCERIDE O-ACYLTRANSFERASE 2 INHIBITORS WIPO 0:0 (2022) Target
Name:
Diacylglycerol O-acyltransferase 2
Synonyms:
ARAT DGAT2 Diacylglycerol O-acyltransferase 2 (DGAT2) Retinol O-fatty-acyltransferase
Type:
Multi-pass membrane protein
Mol. Mass.:
43848.90
Organism:
Homo sapiens (Human)
Description:
Q96PD7
Residue:
388
  
Inhibitor
Name:
BDBM530696
Synonyms:
(S)-6-Chloro-1-(3-(difluoromethoxy)phenyl)-3-isopropyl-N-(3-methyl-l,1-dioxidotetrahydrothiophen-3-yl)-2-oxo-2,3-dihydro-1H-benzo[d]imidazole-5-carboxamide | WO2022076495, EXAMPLE 127
Type:
Small organic molecule
Emp. Form.:
C24H26ClF2N3O5S
Mol. Mass.:
541.995
SMILES:
CC(C)n1c2cc(C(=O)NC3(C)CCS(=O)(=O)CC3)c(Cl)cc2n(-c2cccc(OC(F)F)c2)c1=O
: