Target
Diacylglycerol O-acyltransferase 2
Ligand
BDBM530758
Substrate
IC50
>9990±n/a nM
Citation
 Yeon-Hee, LJianming, BP., RJYeon-Hee, LJianming, BP., RJ PREPARATION OF OXINDOLE DERIVATIVES AS NOVEL DIACYLGLYCERIDE O-ACYLTRANSFERASE 2 INHIBITORS WIPO 0:0 (2022) Target
Name:
Diacylglycerol O-acyltransferase 2
Synonyms:
ARAT DGAT2 Diacylglycerol O-acyltransferase 2 (DGAT2) Retinol O-fatty-acyltransferase
Type:
Multi-pass membrane protein
Mol. Mass.:
43848.90
Organism:
Homo sapiens (Human)
Description:
Q96PD7
Residue:
388
  
Inhibitor
Name:
BDBM530758
Synonyms:
WO2022076496, Example 55
Type:
Small organic molecule
Emp. Form.:
C24H29N3O6S2
Mol. Mass.:
519.634
SMILES:
CNS(=O)(=O)c1cccc(c1)N1C(=O)C(C)(C)c2cc(ccc12)C(=O)NC1(C)CCS(=O)(=O)CC1
: