Target
Diacylglycerol O-acyltransferase 2
Ligand
BDBM530783
Substrate
IC50
2060±n/a nM
Citation
 Yeon-Hee, LJianming, BP., RJYeon-Hee, LJianming, BP., RJ PREPARATION OF OXINDOLE DERIVATIVES AS NOVEL DIACYLGLYCERIDE O-ACYLTRANSFERASE 2 INHIBITORS WIPO 0:0 (2022) Target
Name:
Diacylglycerol O-acyltransferase 2
Synonyms:
ARAT DGAT2 Diacylglycerol O-acyltransferase 2 (DGAT2) Retinol O-fatty-acyltransferase
Type:
Multi-pass membrane protein
Mol. Mass.:
43848.90
Organism:
Homo sapiens (Human)
Description:
Q96PD7
Residue:
388
  
Inhibitor
Name:
BDBM530783
Synonyms:
WO2022076496, Example 80
Type:
Small organic molecule
Emp. Form.:
C23H24F3N3O4S
Mol. Mass.:
495.515
SMILES:
CC1(C)C(=O)N(c2ccc(cc12)C(=O)NC1(C)CCS(=O)(=O)CC1)c1cc(ccn1)C(F)(F)F
: