Target
Diacylglycerol O-acyltransferase 2
Ligand
BDBM530846
Substrate
IC50
0.51±n/a nM
Citation
 Yeon-Hee, LJianming, BP., RJYeon-Hee, LJianming, BP., RJ PREPARATION OF OXINDOLE DERIVATIVES AS NOVEL DIACYLGLYCERIDE O-ACYLTRANSFERASE 2 INHIBITORS WIPO 0:0 (2022) Target
Name:
Diacylglycerol O-acyltransferase 2
Synonyms:
ARAT DGAT2 Diacylglycerol O-acyltransferase 2 (DGAT2) Retinol O-fatty-acyltransferase
Type:
Multi-pass membrane protein
Mol. Mass.:
43848.90
Organism:
Homo sapiens (Human)
Description:
Q96PD7
Residue:
388
  
Inhibitor
Name:
BDBM530846
Synonyms:
WO2022076496, Example 137
Type:
Small organic molecule
Emp. Form.:
C22H20F4N2O5S
Mol. Mass.:
500.463
SMILES:
CC1(CS(=O)(=O)C1)NC(=O)c1cc2c(N(C(=O)C2(C)C)c2cc(OC(F)F)ccc2F)c(F)c1
: