Target
Diacylglycerol O-acyltransferase 2
Ligand
BDBM530855
Substrate
IC50
351±n/a nM
Citation
 Yeon-Hee, LJianming, BP., RJYeon-Hee, LJianming, BP., RJ PREPARATION OF OXINDOLE DERIVATIVES AS NOVEL DIACYLGLYCERIDE O-ACYLTRANSFERASE 2 INHIBITORS WIPO 0:0 (2022) Target
Name:
Diacylglycerol O-acyltransferase 2
Synonyms:
ARAT DGAT2 Diacylglycerol O-acyltransferase 2 (DGAT2) Retinol O-fatty-acyltransferase
Type:
Multi-pass membrane protein
Mol. Mass.:
43848.90
Organism:
Homo sapiens (Human)
Description:
Q96PD7
Residue:
388
  
Inhibitor
Name:
BDBM530855
Synonyms:
WO2022076496, Example 146
Type:
Small organic molecule
Emp. Form.:
C22H22F3N3O5S
Mol. Mass.:
497.487
SMILES:
C[C@]1(CCS(=O)(=O)C1)NC(=O)c1cnc2N(C(=O)C(C)(C)c2c1)c1cc(OC(F)F)ccc1F
: