Target
Receptor tyrosine-protein kinase erbB-2
Ligand
BDBM304259
Substrate
Meas. Tech.
BT474 Cell Viability Assay for Antibody-Polymer-Drug Conjugates
IC50
6.30±n/a nM
Citation
 Yin, MThomas, JDYurkovetskiy, AVConlon, PRDu, BKelleher, EWLowinger, TBTang, S Pyrrolobenzodiazepines and conjugates thereof US Patent  US10143695 Publication Date 12/4/2018 
Target
Name:
Receptor tyrosine-protein kinase erbB-2
Synonyms:
2.7.10.1 CD_antigen=CD340 ERBB2_HUMAN FASN/HER2 HER2 MLN19 NEU Proto-oncogene Neu Tyrosine kinase-type cell surface receptor HER2 | p185erbB2
Type:
Mol. Mass.:
137894.47
Organism:
Homo sapiens (Human)
Description:
P04626
Residue:
1255
  
Inhibitor
Name:
BDBM304259
Synonyms:
US10143695, Compound 85
Type:
Small organic molecule
Emp. Form.:
C44H43N11O9
Mol. Mass.:
869.8805
SMILES:
COC(=O)c1cnc2n(ccc2c1)C(=O)c1cc(NC(=O)c2cc(NC(=O)c3nc(NC(=O)CCCOc4cc5N=C[C@@H]6CC(=C)CN6C(=O)c5cc4OC)cn3C)cn2C)cn1C
: