Target
Replicase polyprotein 1ab
Ligand
BDBM533501
Substrate
Meas. Tech.
MTase Filter-Binding Assay (FBA)
IC50
7600±1200 nM
Citation
 Ahmed-Belkacem, RHausdorff, MDelpal, ASutto-Ortiz, PColmant, AMGTouret, FOgando, NSSnijder, EJCanard, BCoutard, BVasseur, JJDecroly, EDebart, F Potent Inhibition of SARS-CoV-2 nsp14  J Med Chem 65:6231-6249 (2022)  
Target
Name:
Replicase polyprotein 1ab
Synonyms:
3C-like proteinase 3C-like proteinase (SARS-CoV 3Cpro) 3CLp GFL Guanine-N7 methyltransferase Helicase Leader protein Non-structural protein 10 Non-structural protein 3 Non-structural protein 6 Non-structural protein 8 ORF1ab polyprotein PL2-PRO Pol R1AB_SARS RdRp SARS coronavirus main proteinase nsp1 nsp12 nsp14 nsp16 nsp3 nsp5 nsp7 nsp9 pp1ab | rep
Type:
Protein
Mol. Mass.:
790250.81
Organism:
Human SARS coronavirus (SARS-CoV) (Severe acute respiratory syndrome coronavirus)
Description:
P0C6X7
Residue:
7073
  
Inhibitor
Name:
BDBM533501
Synonyms:
jm2c00120, Compound 2
Type:
Small Organic Molecule
Emp. Form.:
C16H17N7O7S
Mol. Mass.:
451.414
SMILES:
Nc1ncnc2n(cnc12)[C@@H]1O[C@H](CNS(=O)(=O)c2ccc(cc2)[N+]([O-])=O)[C@@H](O)[C@H]1O
: