Target
Histone acetyltransferase KAT6A [507-778]
Ligand
BDBM534125
Substrate
Meas. Tech.
Kat6a Activity Assay
IC50
3380±n/a nM
Citation
 L?a, BDaniel, KAntonius, TLSimon, HNaomi, BRoman, HRoland, NStefan, GJ?rg, WAmaury, FEMatyas, GVera, PRobin, MAndreas, SJames, FS SUBSTITUTED ACYL SULFONAMIDES FOR TREATING CANCER WIPO 0:0 (2022) Target
Name:
Histone acetyltransferase KAT6A [507-778]
Synonyms:
2.3.1.48 KAT6A MOZ MYST-3 Monocytic leukemia zinc finger protein Runt-related transcription factor-binding protein 2 Zinc finger protein 220
Type:
PROTEIN
Mol. Mass.:
224994.11
Organism:
Homo sapiens
Description:
Q92794[507-778]
Residue:
2004
  
Inhibitor
Name:
BDBM534125
Synonyms:
N-([1,1'-biphenyl]-2-sulfonyl)-6-(4-fluorophenyl)-1-benzofuran-2-carboxamide | WO2022081842, Example 1
Type:
Small organic molecule
Emp. Form.:
C28H19FO4S
Mol. Mass.:
470.511
SMILES:
Fc1ccc(cc1)-c1ccc2cc(oc2c1)C(=C)OS(=O)(=O)c1ccccc1-c1ccccc1
: