Target
Histone acetyltransferase KAT6A [507-778]
Ligand
BDBM534139
Substrate
Meas. Tech.
Kat6a Activity Assay
IC50
908±n/a nM
Citation
 L?a, BDaniel, KAntonius, TLSimon, HNaomi, BRoman, HRoland, NStefan, GJ?rg, WAmaury, FEMatyas, GVera, PRobin, MAndreas, SJames, FS SUBSTITUTED ACYL SULFONAMIDES FOR TREATING CANCER WIPO 0:0 (2022) Target
Name:
Histone acetyltransferase KAT6A [507-778]
Synonyms:
2.3.1.48 KAT6A MOZ MYST-3 Monocytic leukemia zinc finger protein Runt-related transcription factor-binding protein 2 Zinc finger protein 220
Type:
PROTEIN
Mol. Mass.:
224994.11
Organism:
Homo sapiens
Description:
Q92794[507-778]
Residue:
2004
  
Inhibitor
Name:
BDBM534139
Synonyms:
WO2022081842, Example 15
Type:
Small organic molecule
Emp. Form.:
C24H18FNO4S
Mol. Mass.:
435.467
SMILES:
Fc1c(ccc2cc(oc12)C(=O)NS(=O)(=O)c1ccccc1-c1ccccc1)C1CC1
: