Target
Histone acetyltransferase KAT6B
Ligand
BDBM534149
Substrate
Meas. Tech.
Kat6b Activity Assay
IC50
19±n/a nM
Citation
 L?a, BDaniel, KAntonius, TLSimon, HNaomi, BRoman, HRoland, NStefan, GJ?rg, WAmaury, FEMatyas, GVera, PRobin, MAndreas, SJames, FS SUBSTITUTED ACYL SULFONAMIDES FOR TREATING CANCER WIPO 0:0 (2022) Target
Name:
Histone acetyltransferase KAT6B
Synonyms:
2.3.1.48 Histone acetyltransferase MOZ2 KAT6B_HUMAN MORF MOZ2 MYST4 | Monocytic leukemia zinc finger protein-related factor
Type:
PROTEIN
Mol. Mass.:
231353.44
Organism:
Homo sapiens
Description:
ChEMBL_116754
Residue:
2073
  
Inhibitor
Name:
BDBM534149
Synonyms:
WO2022081842, Example 24
Type:
Small organic molecule
Emp. Form.:
C21H18FNO5S
Mol. Mass.:
415.435
SMILES:
Fc1cc(cc2oc(cc12)C(=O)NS(=O)(=O)c1ccccc1OC1CC1)C1CC1
: