Target
Histone acetyltransferase KAT6A [507-778]
Ligand
BDBM534162
Substrate
Meas. Tech.
Kat6a Activity Assay
IC50
78±n/a nM
Citation
 L?a, BDaniel, KAntonius, TLSimon, HNaomi, BRoman, HRoland, NStefan, GJ?rg, WAmaury, FEMatyas, GVera, PRobin, MAndreas, SJames, FS SUBSTITUTED ACYL SULFONAMIDES FOR TREATING CANCER WIPO 0:0 (2022) Target
Name:
Histone acetyltransferase KAT6A [507-778]
Synonyms:
2.3.1.48 KAT6A MOZ MYST-3 Monocytic leukemia zinc finger protein Runt-related transcription factor-binding protein 2 Zinc finger protein 220
Type:
PROTEIN
Mol. Mass.:
224994.11
Organism:
Homo sapiens
Description:
Q92794[507-778]
Residue:
2004
  
Inhibitor
Name:
BDBM534162
Synonyms:
6-Cyclopropyl-N-(2,4-dichlorophenyl)sulfonyl-4-fluoro-benzofuran-2-carboxamide | WO2022081842, Example 37
Type:
Small organic molecule
Emp. Form.:
C18H12Cl2FNO4S
Mol. Mass.:
428.262
SMILES:
Fc1cc(cc2oc(cc12)C(=O)NS(=O)(=O)c1ccc(Cl)cc1Cl)C1CC1
: