Target
Fusion glycoprotein F0
Ligand
BDBM534229
Substrate
Meas. Tech.
SARS-CoV-2 antiviral assay
EC50
120±n/a nM
Citation
 E., LSWilliam, MJA., MPP., STPeiyuan, W PHOSPHOLIPID COMPOUNDS AND USES THEREOF WIPO 0:0 (2022) Target
Name:
Fusion glycoprotein F0
Synonyms:
F Fusion glycoprotein F0 Fusion glycoprotein F2 Pep27 p27
Type:
PROTEIN
Mol. Mass.:
63471.29
Organism:
Human respiratory syncytial virus A (strain A2)
Description:
ChEMBL_116942
Residue:
574
  
Inhibitor
Name:
BDBM534229
Synonyms:
((2R,3S,4R,5R)-5-(4-aminopyrrolo[2,1-f][1,2,4]triazin-7-yl)-5-cyano-3,4-dihydroxytetrahydrofuran-2-yl)methyl ((R)-1-((3-fluoro-5-(methylsulfonyl)benzyl)oxy)-3-(octadecyloxy)propan-2-yl) hydrogen phosphate (33) | WO2022081973, Example 33
Type:
Small organic molecule
Emp. Form.:
C40H61FN5O11PS
Mol. Mass.:
869.976
SMILES:
CCCCCCCCCCCCCCCCOC[C@@H](COCc1cc(F)cc(c1)S(C)(=O)=O)COP(O)(=O)OC[C@H]1O[C@](C#N)([C@H](O)[C@@H]1O)c1ccc2c(N)ncnn12
: