Target
Mixed lineage kinase domain-like protein
Ligand
BDBM534427
Substrate
Meas. Tech.
MLKL Phosphorylation High-Content Assay
IC50
0.30±n/a nM
Citation
 Guanglin, LJie, CDiane, DCB., FDJunqing, GC., HAXirui, HE., MMReiser, PMJianliang, SH., SSLee, VBYong-Jin, WZili, XG., YM TRIAZOLOPYRIDINYL COMPOUNDS AS KINASE INHIBITORS WIPO 0:0 (2022) Target
Name:
Mixed lineage kinase domain-like protein
Synonyms:
MLKL Mixed lineage kinase domain-like protein | hMLKL
Type:
PROTEIN
Mol. Mass.:
54493.57
Organism:
Homo sapiens
Description:
ChEMBL_104428
Residue:
471
  
Inhibitor
Name:
BDBM534427
Synonyms:
3-(2-amino-[1,2,4]triazolo[1,5-α]pyridin-7-yl)-6-chloro-N-(3-(4-chloro-2-fluorophenyl)-2,2-difluoro-3-hydroxypropyl)-2 -fluorobenzamide | WO2022086828, Example 163
Type:
Small organic molecule
Emp. Form.:
C22H15Cl2F4N5O2
Mol. Mass.:
528.286
SMILES:
Nc1nc2cc(ccn2n1)-c1ccc(Cl)c(C(=O)NCC(F)(F)[C@H](O)c2ccc(Cl)cc2F)c1F
: