Target
Mixed lineage kinase domain-like protein
Ligand
BDBM534449
Substrate
Meas. Tech.
MLKL Phosphorylation High-Content Assay
IC50
0.60±n/a nM
Citation
 Guanglin, LJie, CDiane, DCB., FDJunqing, GC., HAXirui, HE., MMReiser, PMJianliang, SH., SSLee, VBYong-Jin, WZili, XG., YM TRIAZOLOPYRIDINYL COMPOUNDS AS KINASE INHIBITORS WIPO 0:0 (2022) Target
Name:
Mixed lineage kinase domain-like protein
Synonyms:
MLKL Mixed lineage kinase domain-like protein | hMLKL
Type:
PROTEIN
Mol. Mass.:
54493.57
Organism:
Homo sapiens
Description:
ChEMBL_104428
Residue:
471
  
Inhibitor
Name:
BDBM534449
Synonyms:
WO2022086828, Example 185
Type:
Small organic molecule
Emp. Form.:
C23H19ClF3N5O3
Mol. Mass.:
505.877
SMILES:
COc1ccc(cc1)[C@@H](O)C(F)(F)CNC(=O)c1c(Cl)ccc(c1F)-c1ccn2nc(N)nc2c1
: