Target
Epidermal growth factor receptor [1-18,20-1210,T790M,C797S]
Ligand
BDBM547920
Substrate
Meas. Tech.
Ba/F3 cell model generation and proliferation assays
IC50
1.60±n/a nM
Citation
 Harald, EMark, PJuergen, RUlrich, RHeinz, SDirk, STobias, W SUBSTITUTED 1H-PYRAZOLO[4,3-C]PYRIDINES AND DERIVATIVES AS EGFR INHIBITORS WIPO 0:0 (2022) Target
Name:
Epidermal growth factor receptor [1-18,20-1210,T790M,C797S]
Synonyms:
EGFR ERBB Epidermal growth factor receptor (EGFR)(del19/T790M/C797S) | HER1
Type:
Enzyme Catalytic Domain
Mol. Mass.:
134190.47
Organism:
Homo sapiens (Human)
Description:
P00533[1-18,20-1210,T790M,C797S]
Residue:
1209
  
Inhibitor
Name:
BDBM547920
Synonyms:
WO2022090481, Example I-141
Type:
Small organic molecule
Emp. Form.:
C23H23N7O2
Mol. Mass.:
429.4744
SMILES:
CCc1nc(cc2n(C)c(=O)n(C)c12)-n1ncc2c(C)nc(cc12)-c1cnccc1OC
: